In file included from src/config.cpp:37: inc/config.hpp: In member function `DataType Sobby::Config::ValueEntry::get(const serialise::context_base_from&) const': inc/config.hpp:322: error: parse error before `>' token inc/config.hpp: In member function `DataType Sobby::Config::ParentEntry::get_value(const Glib::ustring&, const DataType&, const serialise::context_base_from&) const': inc/config.hpp:406: error: parse error before `>' token make: *** [sobby-config.o] Error 1 make: *** Waiting for unfinished jobs.... !!! ERROR: net-misc/sobby-0.4.0_rc1 failed. Call stack: ebuild.sh, line 1539: Called dyn_compile ebuild.sh, line 939: Called src_compile sobby-0.4.0_rc1.ebuild, line 29: Called die !!! make failed !!! If you need support, post the topmost build error, and the call stack if relevant.