Making check in tools
make[1]: Entering directory `/home/alban/darcs/telepathy-gabble-alban-tests/tests/twisted/tools'
make check-am
make[2]: Entering directory `/home/alban/darcs/telepathy-gabble-alban-tests/tests/twisted/tools'
make[2]: Nothing to be done for `check-am'.
make[2]: Leaving directory `/home/alban/darcs/telepathy-gabble-alban-tests/tests/twisted/tools'
make[1]: Leaving directory `/home/alban/darcs/telepathy-gabble-alban-tests/tests/twisted/tools'
make[1]: Entering directory `/home/alban/darcs/telepathy-gabble-alban-tests/tests/twisted'
make check-TESTS check-local
make[2]: Entering directory `/home/alban/darcs/telepathy-gabble-alban-tests/tests/twisted'
make -C tools
make[3]: Entering directory `/home/alban/darcs/telepathy-gabble-alban-tests/tests/twisted/tools'
make all-am
==================
All 0 tests passed
==================
make[4]: Entering directory `/home/alban/darcs/telepathy-gabble-alban-tests/tests/twisted/tools'
make[4]: Nothing to be done for `all-am'.
make[4]: Leaving directory `/home/alban/darcs/telepathy-gabble-alban-tests/tests/twisted/tools'
make[3]: Leaving directory `/home/alban/darcs/telepathy-gabble-alban-tests/tests/twisted/tools'
rm -f tools/core
sh ./tools/with-session-bus.sh --config-file=tools/tmp-session-bus.conf -- make check-TESTS \
TESTS="jingle/test-incoming-call.py" \
TESTS_ENVIRONMENT="PYTHONPATH=/home/alban/darcs/telepathy-gabble-alban-tests/tests/twisted:/home/alban/darcs/telepathy-gabble-alban-tests/tests/twisted python2.4"
Temporary bus daemon is unix:abstract=/tmp/dbus-vxsYZ08zBd,guid=c1e722e06a83f34ed2e484ef4834671e
Temporary bus daemon PID is 13377
make[3]: Entering directory `/home/alban/darcs/telepathy-gabble-alban-tests/tests/twisted'
got event:
- type dbus-signal
- args: [1L, 1L]
- path: '/Connection/gabble/jabber/test_40localhost_2fResource'
- signal: 'StatusChanged'
handled
got event:
- type stream-iq
- iq_type: u'get'
- query: test\n
- query_name: u'query'
- query_ns: u'jabber:iq:auth'
- stanza: test\n\n
- to: None
not handled
got event:
- type stream-iq
- iq_type: u'set'
- query: test\n 7df6b371925a101c52a4526a0bb5cad6a8b3f1eb\n Resource\n
- query_name: u'query'
- query_ns: u'jabber:iq:auth'
- stanza: test\n 7df6b371925a101c52a4526a0bb5cad6a8b3f1eb\n Resource\n\n
- to: None
not handled
got event:
- type stream-authenticated
handled
got event:
- type stream-iq
- iq_type: 'result'
- query:
- query_name: u'query'
- query_ns: u'http://jabber.org/protocol/disco#info'
- stanza: \n
- to: u'localhost'
not handled
got event:
- type stream-presence
- presence_type: None
- stanza: \n \n
- to: None
not handled
got event:
- type dbus-signal
- args: [{1L: (0L, {u'available': {}})}]
- path: '/Connection/gabble/jabber/test_40localhost_2fResource'
- signal: 'PresenceUpdate'
handled
got event:
- type dbus-signal
- args: [0L, 1L]
- path: '/Connection/gabble/jabber/test_40localhost_2fResource'
- signal: 'StatusChanged'
handled
got event:
- type stream-iq
- iq_type: u'get'
- query:
- query_name: u'query'
- query_ns: u'http://jabber.org/protocol/disco#items'
- stanza: \n
- to: u'localhost'
not handled
got event:
- type stream-iq
- iq_type: u'set'
- query: - \n
\n\n
- query_name: u'pubsub'
- query_ns: u'http://jabber.org/protocol/pubsub'
- stanza: - \n
\n\n\n
- to: None
not handled
got event:
- type stream-iq
- iq_type: u'set'
- query: - \n
\n\n
- query_name: u'pubsub'
- query_ns: u'http://jabber.org/protocol/pubsub'
- stanza: - \n
\n\n\n
- to: None
not handled
got event:
- type stream-iq
- iq_type: u'get'
- query:
- query_name: u'query'
- query_ns: u'jabber:iq:roster'
- stanza: \n
- to: None
not handled
got event:
- type stream-iq
- iq_type: u'get'
- query:
- query_name: u'vCard'
- query_ns: u'vcard-temp'
- stanza: \n
- to: None
not handled
got event:
- type dbus-signal
- args: [{2L: (0L, {u'available': {}})}]
- path: '/Connection/gabble/jabber/test_40localhost_2fResource'
- signal: 'PresenceUpdate'
not handled
got event:
- type dbus-signal
- args: [[(2L,
u'org.freedesktop.Telepathy.Channel.Type.StreamedMedia',
0L,
3L,
0L,
1L)]]
- path: '/Connection/gabble/jabber/test_40localhost_2fResource'
- signal: 'CapabilitiesChanged'
not handled
got event:
- type stream-iq
- iq_type: u'get'
- query:
- query_name: u'query'
- query_node: u'http://telepathy.freedesktop.org/caps#0.6.0'
- query_ns: u'http://jabber.org/protocol/disco#info'
- stanza: \n
- to: u'foo@bar.com/Foo'
handled
got event:
- type dbus-signal
- args: [[(2L,
u'org.freedesktop.Telepathy.Channel.Type.StreamedMedia',
3L,
3L,
1L,
3L)]]
- path: '/Connection/gabble/jabber/test_40localhost_2fResource'
- signal: 'CapabilitiesChanged'
not handled
got event:
- type stream-iq
- iq_type: u'result'
- query: \n \n \n \n \n \n \n \n \n
- query_name: u'query'
- query_ns: u'http://jabber.org/protocol/disco#info'
- stanza: \n \n \n \n \n \n \n \n \n\n
- to: None
handled
got event:
- type dbus-signal
- args: [u'', [2L], [], [], [], 0L, 0L]
- path: '/Connection/gabble/jabber/test_40localhost_2fResource/MediaChannel0'
- signal: 'MembersChanged'
handled
got event:
- type dbus-signal
- args: [1L, 0L]
- path: '/Connection/gabble/jabber/test_40localhost_2fResource/MediaChannel0'
- signal: 'GroupFlagsChanged'
not handled
got event:
- type dbus-signal
- args: ['/org/freedesktop/Telepathy/Connection/gabble/jabber/test_40localhost_2fResource/MediaChannel0/MediaSession2',
u'rtp']
- path: '/Connection/gabble/jabber/test_40localhost_2fResource/MediaChannel0'
- signal: 'NewSessionHandler'
handled
got event:
- type dbus-signal
- args: [u'', [], [], [1L], [], 2L, 0L]
- path: '/Connection/gabble/jabber/test_40localhost_2fResource/MediaChannel0'
- signal: 'MembersChanged'
handled
got event:
- type stream-iq
- iq_type: u'result'
- stanza:
- to: u'foo@bar.com/Foo'
handled
Traceback (most recent call last):
File "./jingle/test-incoming-call.py", line 150, in ?
exec_test(test)
File "/home/alban/darcs/telepathy-gabble-alban-tests/tests/twisted/gabbletest.py", line 299, in exec_test
fun(queue, bus, conn, stream)
File "./jingle/test-incoming-call.py", line 72, in test
assert e.query.name == 'jingle'
AttributeError: Event instance has no attribute 'query'
FAIL: jingle/test-incoming-call.py
=============================================================================
1 of 1 tests failed
Please report to https://bugs.freedesktop.org/enter_bug.cgi?product=Telepathy
=============================================================================
make[3]: *** [check-TESTS] Error 1
make[3]: Leaving directory `/home/alban/darcs/telepathy-gabble-alban-tests/tests/twisted'
Killing temporary bus daemon: 13377
make[2]: *** [check-twisted] Error 2
make[2]: Leaving directory `/home/alban/darcs/telepathy-gabble-alban-tests/tests/twisted'
make[1]: *** [check-am] Error 2
make[1]: Leaving directory `/home/alban/darcs/telepathy-gabble-alban-tests/tests/twisted'
make: *** [check-recursive] Error 1