D:\kderoot\svn\trunk\extragear\multimedia\amarok\src\context\plasma\containment. cpp: In member function `KActionCollection& Plasma::Containment::Private::action s()': D:/kderoot/svn/trunk/extragear/multimedia/amarok/src/context/plasma/applet.h:713 : error: `Plasma::Applet::Private* const Plasma::Applet::d' is private D:\kderoot\svn\trunk\extragear\multimedia\amarok\src\context\plasma\containment. cpp:901: error: within this context D:\kderoot\svn\trunk\extragear\multimedia\amarok\src\context\plasma\containment. cpp: In member function `void Plasma::Containment::Private::positionContainment( )': D:\kderoot\svn\trunk\extragear\multimedia\amarok\src\context\plasma\containment. cpp:1306: warning: passing `qreal' for converting 2 of `QPoint::QPoint(int, int) ' mingw32-make[2]: *** [src/context/CMakeFiles/amarokplasma.dir/plasma/containment .obj] Error 1 mingw32-make[1]: *** [src/context/CMakeFiles/amarokplasma.dir/all] Error 2 mingw32-make: *** [all] Error 2 emerge fatal error: while Make'ing. cmd: mingw32-make emerge fatal error: running python d:\kderoot\emerge\portage\extragear\amarok\am arok-20080211.py compile emerge error: fatal error: package extragear/amarok-20080211 all failed