/usr/kde/3.5/lib/libkhtml.so: undefined reference to `__cxa_get_exception_ptr@CXXABI_1.3.1' collect2: ld returned 1 exit status make[4]: *** [amarokapp] Error 1 make[4]: Leaving directory `/var/tmp/portage/amarok-1.4.1-r3/work/amarok-1.4.1/amarok/src' make[3]: *** [all-recursive] Error 1 make[3]: Leaving directory `/var/tmp/portage/amarok-1.4.1-r3/work/amarok-1.4.1/amarok/src' make[2]: *** [all-recursive] Error 1 make[2]: Leaving directory `/var/tmp/portage/amarok-1.4.1-r3/work/amarok-1.4.1/amarok' make[1]: *** [all-recursive] Error 1 make[1]: Leaving directory `/var/tmp/portage/amarok-1.4.1-r3/work/amarok-1.4.1' make: *** [all] Error 2 !!! ERROR: media-sound/amarok-1.4.1-r3 failed.