00/e17/libs/ecore/src/lib/ecore_x/.libs/libecore_x.so -lXcursor -lXp -lXinerama /home/g nt00/e17/libs/ecore/src/lib/ecore_txt/.libs/libecore_txt.so /home/g3nt00/e17/libs/ecore src/lib/ecore_job/.libs/libecore_job.so /home/g3nt00/e17/libs/ecore/src/lib/ecore_fb/.l bs/libecore_fb.so -L/usr/lib64 /usr/lib64/libevas.so /usr/lib64/libfreetype.so -lpng /u r/lib64/libeet.so /usr/lib/libjpeg.so /usr/lib64/libedb.so -lz -L/usr/lib /usr/lib64/li GLU.so /usr/lib64/libGL.so -lSM -lICE -lXmu -lXt -lXext -lXi -lX11 -lpthread ../../src/ ib/ecore_con/.libs/libecore_con.so ../../src/lib/ecore_ipc/.libs/libecore_ipc.so -L/hom /g3nt00/e17/libs/ecore/src/lib/ecore_con/.libs /home/g3nt00/e17/libs/ecore/src/lib/ecor _con/.libs/libecore_con.so /home/g3nt00/e17/libs/ecore/src/lib/ecore/.libs/libecore.so lssl -lcrypto -ldl -lm -Wl,--rpath -Wl,/usr/local/lib -Wl,--rpath -Wl,/usr/lib ../../src/lib/ecore_evas/.libs/libecore_evas.so: undefined reference to `evas_key_modif er_is_set' ../../src/lib/ecore_evas/.libs/libecore_evas.so: undefined reference to `evas_key_lock_ s_set' collect2: ld returned 1 exit status make[3]: *** [ecore_test] Error 1 make[3]: Leaving directory `/home/g3nt00/e17/libs/ecore/src/bin' make[2]: *** [all-recursive] Error 1 make[2]: Leaving directory `/home/g3nt00/e17/libs/ecore/src' make[1]: *** [all-recursive] Error 1 make[1]: Leaving directory `/home/g3nt00/e17/libs/ecore' make: *** [all] Error 2 g3nt00 ecore # echo $LDPATH g3nt00 ecore #