/usr/local/include/spandsp/dc_restore.h: In function `fsaturate': /usr/local/include/spandsp/dc_restore.h:112: warning: implicit declaration of function `rint' app_rxfax.c: In function `phase_e_handler': app_rxfax.c:104: warning: implicit declaration of function `t30_get_transfer_statistics' app_rxfax.c:105: warning: implicit declaration of function `t30_get_far_ident' app_rxfax.c:106: warning: implicit declaration of function `t30_get_local_ident' app_rxfax.c:137: warning: implicit declaration of function `t30_completion_code_to_str' app_rxfax.c:137: warning: format argument is not a pointer (arg 7) app_rxfax.c: In function `rxfax_exec': app_rxfax.c:199: warning: implicit declaration of function `span_set_message_handler' app_rxfax.c:290: error: structure has no member named `logging' app_rxfax.c:293: warning: implicit declaration of function `t30_set_local_ident' app_rxfax.c:296: warning: implicit declaration of function `t30_set_header_info' app_rxfax.c:297: warning: implicit declaration of function `t30_set_rx_file' app_rxfax.c:299: warning: implicit declaration of function `t30_set_phase_d_handler' app_rxfax.c:300: warning: implicit declaration of function `t30_set_phase_e_handler' app_rxfax.c:311: warning: implicit declaration of function `fax_rx' app_rxfax.c:314: warning: implicit declaration of function `fax_tx' app_rxfax.c: At top level: app_rxfax.c:88: warning: 't30_flush' defined but not used gmake[1]: *** [app_rxfax.o] Error 1 gmake[1]: Leaving directory `/usr/ports/net/asterisk/work/asterisk-1.2.9.1/apps' gmake: *** [subdirs] Error 1 *** Error code 2