./xgcc -B./ -B/usr/i686-pc-linux-gnu/bin/ -isystem /usr/i686-pc-linux-gnu/include -isystem /usr/i686-pc-linux-gnu/sys-include -L/var/tmp/portage/gcc-3.4.6-r1/work/build/gcc/../ld -fno-stack-protector -O2 -DIN_GCC -W -Wall -Wwrite-strings -Wstrict-prototypes -Wmissing-prototypes -Wold-style-definition -isystem ./include -I. -I. -I/var/tmp/portage/gcc-3.4.6-r1/work/gcc-3.4.6/gcc -I/var/tmp/portage/gcc-3.4.6-r1/work/gcc-3.4.6/gcc/. -I/var/tmp/portage/gcc-3.4.6-r1/work/gcc-3.4.6/gcc/../include -g0 -finhibit-size-directive -fno-inline-functions -fno-exceptions -fno-zero-initialized-in-bss -fno-unit-at-a-time -fno-omit-frame-pointer \ -c /var/tmp/portage/gcc-3.4.6-r1/work/gcc-3.4.6/gcc/crtstuff.c -DCRT_BEGIN \ -o crtbegin.o /var/tmp/portage/gcc-3.4.6-r1/temp/cciazlid.s: Assembler messages: /var/tmp/portage/gcc-3.4.6-r1/temp/cciazlid.s:33: Error: suffix or operands invalid for `push' /var/tmp/portage/gcc-3.4.6-r1/temp/cciazlid.s:43: Error: suffix or operands invalid for `call' /var/tmp/portage/gcc-3.4.6-r1/temp/cciazlid.s:61: Error: suffix or operands invalid for `push' make[2]: *** [crtbegin.o] Error 1 make[2]: Leaving directory `/var/tmp/portage/gcc-3.4.6-r1/work/build/gcc' make[1]: *** [stage1_build] Error 2 make[1]: Leaving directory `/var/tmp/portage/gcc-3.4.6-r1/work/build/gcc' make: *** [profiledbootstrap] Error 2 !!! ERROR: sys-devel/gcc-3.4.6-r1 failed. Call stack: ebuild.sh, line 1539: Called dyn_compile ebuild.sh, line 939: Called src_compile ebuild.sh, line 1248: Called toolchain_src_compile toolchain.eclass, line 24: Called gcc_src_compile toolchain.eclass, line 1523: Called gcc_do_make toolchain.eclass, line 1397: Called die !!! emake failed with profiledbootstrap !!! If you need support, post the topmost build error, and the call stack if relevant.