i686-2.4/posix_signal.o i686-pc-linux-gnu-gcc -pthread -shared -O3 -march=pentium3 -funroll-loops -pipe -std=c99 -pedantic -Wall -DPKGDATADIR="/usr/share/adesklets" build/temp.linux-i686-2.4/posix_signal.o -o build/lib.linux-i686-2.4/posix_signal.so make[2]: Leaving directory `/var/tmp/portage/adesklets-0.6.1/work/adesklets-0.6.1/scripting/python' Making all in perl make[2]: Entering directory `/var/tmp/portage/adesklets-0.6.1/work/adesklets-0.6.1/scripting/perl' /usr/bin/perl Makefile.PL Writing makefile.perl for adesklets make -f makefile.perl make[3]: Entering directory `/var/tmp/portage/adesklets-0.6.1/work/adesklets-0.6.1/scripting/perl' Makefile out-of-date with respect to Makefile.PL Cleaning current config before rebuilding Makefile... make -f makefile.perl.old clean > /dev/null 2>&1 || /bin/sh -c true /usr/bin/perl5.8.7 Makefile.PL cp adesklets.pm blib/lib/adesklets.pm cp updateproto.pl blib/lib/updateproto.pl Checking if your kit is complete... Looks good Writing makefile.perl for adesklets ==> Your Makefile has been rebuilt. <== ==> Please rerun the make command. <== false make[3]: *** [Makefile] Error 1 make[3]: Leaving directory `/var/tmp/portage/adesklets-0.6.1/work/adesklets-0.6.1/scripting/perl' make[2]: *** [perl-compile] Error 2 make[2]: Leaving directory `/var/tmp/portage/adesklets-0.6.1/work/adesklets-0.6.1/scripting/perl' make[1]: *** [all-recursive] Error 1 make[1]: Leaving directory `/var/tmp/portage/adesklets-0.6.1/work/adesklets-0.6.1/scripting' make: *** [all-recursive] Error 1 !!! ERROR: x11-misc/adesklets-0.6.1 failed. Call stack: ebuild.sh, line 1539: Called dyn_compile ebuild.sh, line 939: Called src_compile adesklets-0.6.1.ebuild, line 58: Called die !!! (no error message) !!! If you need support, post the topmost build error, and the call stack if relevant. lestat ~ #