| ../../../../src/text/fmt/xp/libFmt.a(fv_View.o):(.bss._ZZNK19UT_GenericStringMapIPcE4_keyERNS1_9UT_CursorEE3bad[*UT_GenericStringMap::_key(UT_GenericStringMap::UT_Cursor&) const::bad]+0x0): multiple definition of `UT_GenericStringMap::_key(UT_GenericStringMap::UT_Cursor&) const::bad' | ../../../../src/wp/impexp/libImpExp.a(ie_imp_PasteListener.o):(.bss._ZZNK19UT_GenericStringMapIPcE4_keyERNS1_9UT_CursorEE3bad[UT_GenericStringMap::_key(UT_GenericStringMap::UT_Cursor&) const::bad]+0x0): first defined here | collect2: ld returned 1 exit status | make[4]: *** [AbiWord-2.2] Error 1 | make[4]: Leaving directory `/home/hrw/zaurus/oe/build/0602/tmp/work/armv5te-linux/abiword-2.2.7-r2/abiword-2.2.7/abi/src/wp/main/unix' | make[3]: *** [all-recursive] Error 1 | make[3]: Leaving directory `/home/hrw/zaurus/oe/build/0602/tmp/work/armv5te-linux/abiword-2.2.7-r2/abiword-2.2.7/abi/src/wp/main' | make[2]: *** [all-recursive] Error 1 | make[2]: Leaving directory `/home/hrw/zaurus/oe/build/0602/tmp/work/armv5te-linux/abiword-2.2.7-r2/abiword-2.2.7/abi/src/wp' | make[1]: *** [all-recursive] Error 1 | make[1]: Leaving directory `/home/hrw/zaurus/oe/build/0602/tmp/work/armv5te-linux/abiword-2.2.7-r2/abiword-2.2.7/abi/src' | make: *** [all-recursive] Error 1 | FATAL: oe_runmake failed NOTE: [12:02] Task failed: NOTE: [12:02] package abiword-2.2.7-r2: task do_compile: failed ERROR: TaskFailed event exception, aborting NOTE: [12:02] package abiword-2.2.7: failed