cc -O2 -g -pipe -m32 -march=i386 -mtune=pentium4 -DMAXSESS -DUSE_PAM -g -O2 -DLINUX -DGLIBC -DTACPLUS_PIDFILE=\"/var/run/tac_plus.pid\" -DUSE_DB -DDB_NULL -c -o maxsess.o maxsess.c gcc -O2 -g -pipe -m32 -march=i386 -mtune=pentium4 -DMAXSESS -DUSE_PAM -g -O2 -DLINUX -DGLIBC -DTACPLUS_PIDFILE=\"/var/run/tac_plus.pid\" -DUSE_DB -DDB_NULL -c -o tac_pam.o tac_pam.c gcc -O2 -g -pipe -m32 -march=i386 -mtune=pentium4 -DMAXSESS -DUSE_PAM -g -O2 -DLINUX -DGLIBC -DTACPLUS_PIDFILE=\"/var/run/tac_plus.pid\" -DUSE_DB -DDB_NULL -c -o db.o db.c gcc -O2 -g -pipe -m32 -march=i386 -mtune=pentium4 -DMAXSESS -DUSE_PAM -g -O2 -DLINUX -DGLIBC -DTACPLUS_PIDFILE=\"/var/run/tac_plus.pid\" -DUSE_DB -DDB_NULL -c -o db_null.o db_null.c db_null.c: In function `null_db_acct': db_null.c:51: error: missing terminating " character db_null.c:52: error: syntax error before '%' token db_null.c:52: error: missing terminating " character make: *** [db_null.o] Error 1 error: Bad exit status from /var/tmp/rpm-tmp.69199 (%build) RPM build errors: Bad exit status from /var/tmp/rpm-tmp.69199 (%build)