1>------ Build started: Project: PortableMorpher, Configuration: Release Win32 ------ 1>Compiling... 1>PortableMorpher.cpp 1>..\src\PortableMorpher\PortableMorpher.cpp(27) : error C2664: 'ObjectMgr::CreateGossipMenuForPlayer' : cannot convert parameter 4 from 'Player *' to 'PlayerPointer' 1> Constructor for class 'std::tr1::shared_ptr<_Ty>' is declared 'explicit' 1> with 1> [ 1> _Ty=Player 1> ] 1>..\src\PortableMorpher\PortableMorpher.cpp(37) : error C2664: 'GossipMenu::SendTo' : cannot convert parameter 1 from 'Player *' to 'PlayerPointer' 1> Constructor for class 'std::tr1::shared_ptr<_Ty>' is declared 'explicit' 1> with 1> [ 1> _Ty=Player 1> ] 1>..\src\PortableMorpher\PortableMorpher.cpp(93) : error C2664: 'GossipScript::GossipEnd' : cannot convert parameter 1 from 'Object *' to 'ObjectPointer' 1> Constructor for class 'std::tr1::shared_ptr<_Ty>' is declared 'explicit' 1> with 1> [ 1> _Ty=Object 1> ] 1>Setup.cpp 1>Build log was saved at "file://c:\server\AspireCore\branches\Hearthstone\src\scripts\projects\2008_int_release_PortableMorpher\BuildLog.htm" 1>PortableMorpher - 3 error(s), 0 warning(s) ========== Build: 0 succeeded, 1 failed, 0 up-to-date, 0 skipped ==========