if ..//makeinfo/makeinfo -I . \ -o info.info `test -f 'info.texi' || echo './'`info.texi; \ then \ rc=0; \ else \ rc=$?; \ $restore $backupdir/* `echo "./info.info" | sed 's|[^/]*$||'`; \ fi; \ rm -rf $backupdir; exit $rc make[2]: *** [texinfo.info] Error 132 make[2]: *** Waiting for unfinished jobs.... make[2]: Leaving directory `/var/tmp/portage/texinfo-4.8/work/texinfo-4.8/doc' make[1]: *** [all-recursive] Error 1 make[1]: Leaving directory `/var/tmp/portage/texinfo-4.8/work/texinfo-4.8' make: *** [all] Error 2 !!! ERROR: sys-apps/texinfo-4.8 failed. !!! Function src_compile, Line 47, Exitcode 2 !!! emake !!! If you need support, post the topmost build error, NOT this status message.