root@Jocitex:~/admuser-2.3.1# make gcc -c -O2 -w -I. -DPACKAGE_NAME=\"\" -DPACKAGE_TARNAME=\"\" -DPACKAGE_VERSION=\"\" -DPACKAGE_STRING=\"\" -DPACKAGE_BUGREPORT=\"\" -DHAVE_LIBCRYPT=1 -DHAVE_DIRENT_H=1 -DSTDC_HEADERS=1 -DHAVE_SYS_TYPES_H=1 -DHAVE_SYS_STAT_H=1 -DHAVE_STDLIB_H=1 -DHAVE_STRING_H=1 -DHAVE_MEMORY_H=1 -DHAVE_STRINGS_H=1 -DHAVE_INTTYPES_H=1 -DHAVE_STDINT_H=1 -DHAVE_UNISTD_H=1 -DHAVE_CRYPT_H=1 -DHAVE_PWD_H=1 -DHAVE_STDIO_H=1 -DHAVE_STDLIB_H=1 -DHAVE_SYS_STAT_H=1 -DHAVE_SYS_TIME_H=1 -DHAVE_TIME_H=1 -DHAVE_UNISTD_H=1 -DHAVE_STRSTR=1 -DPREFIX=\"/usr/local/etc/admuser\" -DCGIDIR=\"/var/www/cgi-bin\" -DEnglish admuser.c admuser.c:374: error: static declaration of âfix_stringâ follows non-static declaration admuser.c:161: error: previous implicit declaration of âfix_stringâ was here admuser.c:427: error: static declaration of âhtoiâ follows non-static declaration admuser.c:384: error: previous implicit declaration of âhtoiâ was here admuser.c:1433: error: static declaration of âUserFormâ follows non-static declaration admuser.c:135: error: previous implicit declaration of âUserFormâ was here admuser.c:1538: error: static declaration of âgo_Authenticateâ follows non-static declaration admuser.c:172: error: previous implicit declaration of âgo_Authenticateâ was here make: *** [admuser.o] Error 1