gcc -pipe -Wall -Wstrict-prototypes -Wmissing-prototypes -Wmissing-declarations -g -Iinclude -I../include -D_REENTRANT -D_GNU_SOURCE -O6 -march=i686 -DZAPTEL_OPTIMIZATIONS -DBUSYDETECT_MARTIN -fomit-frame-pointer -fPIC -c -o app_zapscan.o app_zapscan.c app_zapscan.c: In function `get_zap_channel_locked': app_zapscan.c:63: warning: unused variable `c' gcc -shared -Xlinker -x -o app_zapscan.so app_zapscan.o gcc -pipe -Wall -Wstrict-prototypes -Wmissing-prototypes -Wmissing-declarations -g -Iinclude -I../include -D_REENTRANT -D_GNU_SOURCE -O6 -march=i686 -DZAPTEL_OPTIMIZATIONS -DBUSYDETECT_MARTIN -fomit-frame-pointer -fPIC -c -o app_rxfax.o app_rxfax.c app_rxfax.c: In function `phase_e_handler': app_rxfax.c:93: error: structure has no member named `callerid' app_rxfax.c: At top level: app_rxfax.c:61: warning: 't30_flush' defined but not used make[1]: *** [app_rxfax.o] Error 1 make[1]: Leaving directory `/usr/src/asterisk/apps' make: *** [subdirs] Error 1