/var/tmp/portage/openmotif-2.2.3-r9/work/openMotif-2.2.3/missing: Unknown `--run' option Try `/var/tmp/portage/openmotif-2.2.3-r9/work/openMotif-2.2.3/missing --help' for more information configure: WARNING: `missing' script is too old or missing configure: WARNING: X11/Xmu/Editres.h: present but cannot be compiled configure: WARNING: X11/Xmu/Editres.h: check for missing prerequisite headers? configure: WARNING: X11/Xmu/Editres.h: see the Autoconf documentation configure: WARNING: X11/Xmu/Editres.h: section "Present But Cannot Be Compiled" configure: WARNING: X11/Xmu/Editres.h: proceeding with the preprocessor's result configure: WARNING: X11/Xmu/Editres.h: in the future, the compiler will take precedence configure: WARNING: ## ------------------------------------------ ## configure: WARNING: ## Report this to the AC_PACKAGE_NAME lists. ## configure: WARNING: ## ------------------------------------------ ## In file included from XmStrDefs.c:10: ../Xm/Xm.h:59:34: X11/extensions/Print.h: No such file or directory In file included from XmStrDefs.c:10: ../Xm/Xm.h:827: error: parse error before "XPContext" ../Xm/Xm.h:827: warning: no semicolon at end of struct or union ../Xm/Xm.h:830: error: parse error before '}' token ../Xm/Xm.h:830: warning: type defaults to `int' in declaration of `XmPrintShellCallbackStruct' ../Xm/Xm.h:830: warning: data definition has no type or storage class make[3]: *** [XmStrDefs.lo] Error 1 make[2]: *** [all] Error 2 make[1]: *** [all-recursive] Error 1 make: *** [all-recursive] Error 1 !!! ERROR: x11-libs/openmotif-2.2.3-r9 failed. Call stack: ebuild.sh, line 1539: Called dyn_compile ebuild.sh, line 939: Called src_compile openmotif-2.2.3-r9.ebuild, line 84: Called die !!! make failed, if you have lesstif installed removed it, compile openmotif and recompile lesstif !!! If you need support, post the topmost build error, and the call stack if relevant.