make[1]: Entering directory `/home/solaris/r1000_v1.04/src' make -C /lib/modules/2.6.16.21-0.13-smp/build SUBDIRS=/home/solaris/r1000_v1.04/src modules make[2]: Entering directory `/usr/src/linux-2.6.16.21-0.13-obj/i386/smp' make -C ../../../linux-2.6.16.21-0.13 O=../linux-2.6.16.21-0.13-obj/i386/smp modules CC [M] /home/solaris/r1000_v1.04/src/r1000_n.o /home/solaris/r1000_v1.04/src/r1000_n.c:51: error: expected ‘)’ before string constant /home/solaris/r1000_v1.04/src/r1000_n.c:52: error: expected ‘)’ before string constant /home/solaris/r1000_v1.04/src/r1000_n.c:53: error: expected ‘)’ before string constant make[5]: *** [/home/solaris/r1000_v1.04/src/r1000_n.o] Error 1 make[4]: *** [_module_/home/solaris/r1000_v1.04/src] Error 2 make[3]: *** [modules] Error 2 make[2]: *** [modules] Error 2 make[2]: Leaving directory `/usr/src/linux-2.6.16.21-0.13-obj/i386/smp' make[1]: *** [modules] Error 2 make[1]: Leaving directory `/home/solaris/r1000_v1.04/src' make: *** [modules] Error 2