gmake[2]: Entering directory `/root/spandsp-0.0.2/src' if /bin/sh ../libtool --mode=compile gcc -DHAVE_CONFIG_H -I. -I. -I. -I -g -O2 -MT playout.lo -MD -MP -MF ".deps/playout.Tpo" -c -o playout.lo playout.c; \ then mv -f ".deps/playout.Tpo" ".deps/playout.Plo"; else rm -f ".deps/playout.Tpo"; exit 1; fi gcc -DHAVE_CONFIG_H -I. -I. -I. -I -g -O2 -MT playout.lo -MD -MP -MF .deps/playout.Tpo -c playout.c -fPIC -DPIC -o .libs/playout.o In file included from playout.c:42: spandsp/playout.h:124: error: syntax error before "int32_t" playout.c: In function `playout_get': playout.c:129: error: structure has no member named `state_late' playout.c:129: error: structure has no member named `state_late' playout.c:130: error: structure has no member named `state_just_in_time' playout.c:130: error: structure has no member named `state_just_in_time' playout.c:133: error: structure has no member named `state_late' playout.c:142: error: structure has no member named `state_just_in_time' playout.c:143: error: structure has no member named `state_late' playout.c:156: error: structure has no member named `state_just_in_time' playout.c:157: error: structure has no member named `state_late' playout.c:164: error: structure has no member named `state_just_in_time' playout.c:171: error: structure has no member named `state_just_in_time' playout.c:172: error: structure has no member named `state_late' gmake[2]: *** [playout.lo] Error 1 gmake[2]: Leaving directory `/root/spandsp-0.0.2/src' gmake[1]: *** [all] Error 2 gmake[1]: Leaving directory `/root/spandsp-0.0.2/src' gmake: *** [all-recursive] Error 1