/usr/lib/gcc-lib/i686-pc-linux-gnu/3.3.5-20050130/../../../../i686-pc-linux-gnu/bin/ld: cannot find -lidn collect2: ld returned 1 exit status make[4]: *** [libkdecore.la] Error 1 make[4]: Leaving directory `/var/tmp/portage/kdelibs-3.4.1-r1/work/kdelibs-3.4.1/kdecore' make[3]: *** [all-recursive] Error 1 make[3]: Leaving directory `/var/tmp/portage/kdelibs-3.4.1-r1/work/kdelibs-3.4.1/kdecore' make[2]: *** [all] Error 2 make[2]: Leaving directory `/var/tmp/portage/kdelibs-3.4.1-r1/work/kdelibs-3.4.1/kdecore' make[1]: *** [all-recursive] Error 1 make[1]: Leaving directory `/var/tmp/portage/kdelibs-3.4.1-r1/work/kdelibs-3.4.1' make: *** [all] Error 2 !!! ERROR: kde-base/kdelibs-3.4.1-r1 failed. !!! Function kde_src_compile, Line 166, Exitcode 2 !!! died running emake, kde_src_compile:make !!! If you need support, post the topmost build error, NOT this status message.