secure:/usr/src/qmail/vpopmail-5.4.13# make make all-recursive make[1]: Entering directory `/usr/src/qmail/vpopmail-5.4.13' Making all in cdb make[2]: Entering directory `/usr/src/qmail/vpopmail-5.4.13/cdb' make[2]: Nothing to be done for `all'. make[2]: Leaving directory `/usr/src/qmail/vpopmail-5.4.13/cdb' make[2]: Entering directory `/usr/src/qmail/vpopmail-5.4.13' gcc -g -O2 -Wall -o vchkpw vchkpw.o md5.o hmac_md5.o libvpopmail.a -lcrypt /usr/lib/libc_nonshared.a(elf-init.oS)(.gnu.linkonce.t.__i686.get_pc_thunk.bx+0x0): In function `__i686.get_pc_thunk.bx': : multiple definition of `__i686.get_pc_thunk.bx' libvpopmail.a(libvpopmail_a-vpopmail.o)(.gnu.linkonce.t.__i686.get_pc_thunk.bx+0x0):/usr/src/qmail/vpopmail-5.4.13/vpopmail.c:86: first defined here collect2: ld returned 1 exit status make[2]: *** [vchkpw] Error 1 make[2]: Leaving directory `/usr/src/qmail/vpopmail-5.4.13' make[1]: *** [all-recursive] Error 1 make[1]: Leaving directory `/usr/src/qmail/vpopmail-5.4.13' make: *** [all] Error 2 secure:/usr/src/qmail/vpopmail-5.4.13#