[duckdown@localhost epic5-0.3.1]$ make make[1]: Entering directory `/home/duckdown/epic5-0.3.1/source' gcc -g -O -I./../include -I../include -c alias.c gcc -g -O -I./../include -I../include -c alist.c gcc -g -O -I./../include -I../include -c array.c gcc -g -O -I./../include -I../include -c clock.c gcc -g -O -I./../include -I../include -c commands.c gcc -g -O -I./../include -I../include -c compat.c gcc -g -O -I./../include -I../include -c crypt.c gcc -g -O -I./../include -I../include -c crypto.c crypto.c: In function ΓÇÿdecipher_messageΓÇÖ: crypto.c:253: warning: assignment makes pointer from integer without a cast crypto.c: At top level: crypto.c:299: warning: conflicting types for ΓÇÿdecrypt_sedΓÇÖ crypto.c:299: error: static declaration of ΓÇÿdecrypt_sedΓÇÖ follows non-static declaration crypto.c:245: error: previous implicit declaration of ΓÇÿdecrypt_sedΓÇÖ was herecrypto.c:323: error: conflicting types for ΓÇÿdecrypt_by_progΓÇÖ crypto.c:253: error: previous implicit declaration of ΓÇÿdecrypt_by_progΓÇÖ was here crypto.c: In function ΓÇÿcipher_messageΓÇÖ: crypto.c:411: warning: assignment makes pointer from integer without a cast crypto.c: At top level: crypto.c:467: warning: conflicting types for ΓÇÿencrypt_sedΓÇÖ crypto.c:467: error: static declaration of ΓÇÿencrypt_sedΓÇÖ follows non-static declaration crypto.c:403: error: previous implicit declaration of ΓÇÿencrypt_sedΓÇÖ was herecrypto.c:491: error: conflicting types for ΓÇÿencrypt_by_progΓÇÖ crypto.c:411: error: previous implicit declaration of ΓÇÿencrypt_by_progΓÇÖ was here make[1]: *** [crypto.o] Error 1 make[1]: Leaving directory `/home/duckdown/epic5-0.3.1/source' make: *** [epic5] Error 2 [duckdown@localhost epic5-0.3.1]$