CC init/version.o LD init/built-in.o LD .tmp_vmlinux1 init/built-in.o: In function `try_name': do_mounts.c:(.text+0x3db): undefined reference to `__stack_chk_fail' init/built-in.o: In function `name_to_dev_t': (.text+0x63d): undefined reference to `__stack_chk_fail' init/built-in.o: In function `change_floppy': (.init.text+0x774): undefined reference to `__stack_chk_fail' init/built-in.o: In function `mount_block_root': (.init.text+0x985): undefined reference to `__stack_chk_fail' init/built-in.o: In function `do_header': initramfs.c:(.init.text+0x4019): undefined reference to `__stack_chk_fail' arch/i386/kernel/built-in.o:(.text+0x42b7): more undefined references to `__stack_chk_fail' follow make[2]: *** [.tmp_vmlinux1] Error 1 make[2]: Leaving directory `/home/burhan/Desktop/linux-2.6.17.13' make[1]: *** [debian/stamp-build-kernel] Error 2 make[1]: Leaving directory `/home/burhan/Desktop/linux-2.6.17.13' make: *** [stamp-buildpackage] Error 2