-linux/io -I.. -I../libio -I/home/dp/zaurus/build/tmp/work/glibc-2.3.5+cvs20050 627-r0/build-arm-linux -I../ports/sysdeps/arm/elf -I../ports/sysdeps/unix/sysv/l inux/arm/linuxthreads -I../ports/sysdeps/unix/sysv/linux/arm -I../ports/sysdeps/ unix/sysv/linux -I../ports/sysdeps/unix/sysv -I../ports/sysdeps/unix/arm -I../po rts/sysdeps/unix -I../ports/sysdeps/arm/linuxthreads -I../ports/sysdeps/arm -I.. /sysdeps/wordsize-32 -I../sysdeps/ieee754/flt-32 -I../sysdeps/ieee754/dbl-64 -I. ./linuxthreads/sysdeps/unix/sysv/linux -I../linuxthreads/sysdeps/pthread -I../sy sdeps/pthread -I../linuxthreads/sysdeps/unix/sysv -I../linuxthreads/sysdeps/unix -I../sysdeps/unix/sysv/linux -I../sysdeps/gnu -I../sysdeps/unix/common -I../sys deps/unix/mman -I../sysdeps/unix/inet -I../sysdeps/unix/sysv -I../sysdeps/unix - I../sysdeps/posix -I../sysdeps/ieee754 -I../sysdeps/generic/elf -I../sysdeps/gen eric -nostdinc -isystem /home/dp/zaurus/build/tmp/cross/lib/gcc/arm-linux/3.4.4/ include -isystem /home/dp/zaurus/build/tmp/cross/arm-linux/include -D_LIBC_REENT RANT -include ../include/libc-symbols.h -o /home/dp/zaurus/build/tmp/work/ glibc-2.3.5+cvs20050627-r0/build-arm-linux/io/posix_fadvise64.o -MD -MP -MF /hom e/dp/zaurus/build/tmp/work/glibc-2.3.5+cvs20050627-r0/build-arm-linux/io/posix_f advise64.o.dt -MT /home/dp/zaurus/build/tmp/work/glibc-2.3.5+cvs20050627-r0/buil d-arm-linux/io/posix_fadvise64.o ../sysdeps/unix/sysv/linux/posix_fadvise64.c:69:46: macro "SHLIB_COMPAT" require s 3 arguments, but only 2 given make[2]: *** [/home/dp/zaurus/build/tmp/work/glibc-2.3.5+cvs20050627-r0/build-ar m-linux/io/posix_fadvise64.o] Error 1 make[2]: Leaving directory `/home/dp/zaurus/build/tmp/work/glibc-2.3.5+cvs200506 27-r0/libc/io' make[1]: *** [io/subdir_lib] Error 2 make[1]: Leaving directory `/home/dp/zaurus/build/tmp/work/glibc-2.3.5+cvs200506 27-r0/libc' make: *** [all] Error 2