-DXMESSAGE=\"\" -DWALL=\"/usr/bin/wall\" -c machine.c machine.c:90: error: static declaration of 'powermode' follows non-static declaration machine.h:26: error: previous declaration of 'powermode' was here make: *** [machine.o] Error 1 make: Leaving directory `/var/tmp/portage/toshiba-utils-2.0.1-r2/work/toshutils-2.0.1/src' !!! ERROR: app-laptop/toshiba-utils-2.0.1-r2 failed. Call stack: ebuild.sh, line 1546: Called dyn_compile ebuild.sh, line 937: Called src_compile toshiba-utils-2.0.1-r2.ebuild, line 36: Called die !!! (no error message) !!! If you need support, post the topmost build error, and the call stack if relevant. !!! This ebuild is from an overlay: '/usr/local/portage'