ecma/.libs/libkjs_html.a(kjs_binding.o):kjs_binding.cpp:(.text+0x2c47): more undefined references to `__cxa_get_exception_ptr' follow collect2: ld returned 1 exit status make[3]: *** [libkhtml.la] Error 1 make[3]: Leaving directory `/var/tmp/portage/kdelibs-3.5.2-r6/work/kdelibs-3.5.2/khtml' make[2]: *** [all-recursive] Error 1 make[2]: Leaving directory `/var/tmp/portage/kdelibs-3.5.2-r6/work/kdelibs-3.5.2/khtml' make[1]: *** [all-recursive] Error 1 make[1]: Leaving directory `/var/tmp/portage/kdelibs-3.5.2-r6/work/kdelibs-3.5.2' make: *** [all] Error 2 !!! ERROR: kde-base/kdelibs-3.5.2-r6 failed. Call stack: ebuild.sh, line 1546: Called dyn_compile ebuild.sh, line 937: Called src_compile kdelibs-3.5.2-r6.ebuild, line 128: Called kde_src_compile kde.eclass, line 164: Called kde_src_compile 'all' kde.eclass, line 323: Called kde_src_compile 'myconf' 'configure' 'make' kde.eclass, line 319: Called die !!! died running emake, kde_src_compile:make !!! If you need support, post the topmost build error, and the call stack if relevant.