./include -I../../src -march=i586 -O2 -pipe -D_REENTRANT -MT aufs/async_io.o -MD -MP -MF "$depbase.Tpo" -c -o aufs/async_io.o aufs/async_io.c; \ then mv -f "$depbase.Tpo" "$depbase.Po"; else rm -f "$depbase.Tpo"; exit 1; fi depbase=`echo aufs/store_dir_aufs.o | sed 's|[^/]*$|.deps/&|;s|\.o$||'`; \ if ccache gcc -DHAVE_CONFIG_H -I. -I. -I../../include -I. -I../../include -I../../include -I../../src -march=i586 -O2 -pipe -D_REENTRANT -MT aufs/store_dir_aufs.o -MD -MP -MF "$depbase.Tpo" -c -o aufs/store_dir_aufs.o aufs/store_dir_aufs.c; \ then mv -f "$depbase.Tpo" "$depbase.Po"; else rm -f "$depbase.Tpo"; exit 1; fi aufs/store_dir_aufs.c: In function `storeAufsDirUnlinkFile': aufs/store_dir_aufs.c:1637: warning: passing arg 2 of `aioTruncate' makes integer from pointer without a cast aufs/store_dir_aufs.c:1637: error: too few arguments to function `aioTruncate' make[3]: *** [aufs/store_dir_aufs.o] Błąd 1 make[3]: Leaving directory `/home/macieks/mejkownia/BUG/squid/src/squid-2.6.STABLE4/src/fs' make[2]: *** [all-recursive] Błąd 1 make[2]: Leaving directory `/home/macieks/mejkownia/BUG/squid/src/squid-2.6.STABLE4/src' make[1]: *** [all] Błąd 2 make[1]: Leaving directory `/home/macieks/mejkownia/BUG/squid/src/squid-2.6.STABLE4/src' make: *** [all-recursive] Błąd 1 ==> ERROR: Budowa pakietu nieudana. Kończę...