Building CXX object scribus/CMakeFiles/scribus.dir/aligndistribute.o /home/mrdocs/cvs/13/Scribus/scribus/aligndistribute.cpp: In constructor ‘AlignDistributePalette::AlignDistributePalette(QWidget*, const char*, bool, uint)’: /home/mrdocs/cvs/13/Scribus/scribus/aligndistribute.cpp:58: error: ‘toolButtonDummy1’ was not declared in this scope /home/mrdocs/cvs/13/Scribus/scribus/aligndistribute.cpp:59: error: ‘toolButtonDummy2’ was not declared in this scope /home/mrdocs/cvs/13/Scribus/scribus/aligndistribute.cpp: In member function ‘virtual void AlignDistributePalette::languageChange()’: /home/mrdocs/cvs/13/Scribus/scribus/aligndistribute.cpp:142: error: ‘distributeAcrossMarginsToolButton’ was not declared in this scope /home/mrdocs/cvs/13/Scribus/scribus/aligndistribute.cpp:144: error: ‘distributeDownMarginsToolButton’ was not declared in this scope /home/mrdocs/cvs/13/Scribus/scribus/aligndistribute.cpp: In member function ‘void AlignDistributePalette::init()’: /home/mrdocs/cvs/13/Scribus/scribus/aligndistribute.cpp:181: error: ‘distributeAcrossMarginsToolButton’ was not declared in this scope /home/mrdocs/cvs/13/Scribus/scribus/aligndistribute.cpp:182: error: ‘distributeDownMarginsToolButton’ was not declared in this scope make[2]: *** [scribus/CMakeFiles/scribus.dir/aligndistribute.o] Error 1 make[1]: *** [scribus/CMakeFiles/scribus.dir/all] Error 2 make: *** [all] Error 2 mrdocs@linux:~/cvs/cmakescribus>