/usr/lib/python2.4/config/libpython2.4.a(posixmodule.o): In function `posix_tempnam': : warning: the use of `tempnam' is dangerous, better use `mkstemp' /usr/lib/libpangocairo-1.0.so: undefined reference to `cairo_scaled_font_text_extents' /usr/lib/libpangocairo-1.0.so: undefined reference to `cairo_scaled_font_get_ctm' collect2: ld returned 1 exit status distcc[2477] ERROR: compile (null) on localhost failed make[2]: *** [inkscape] Error 1 make[2]: Leaving directory `/var/tmp/portage/inkscape-0.43/work/inkscape-0.43/src' make[1]: *** [all-recursive] Error 1 make[1]: Leaving directory `/var/tmp/portage/inkscape-0.43/work/inkscape-0.43' make: *** [all] Error 2 !!! ERROR: media-gfx/inkscape-0.43 failed. Call stack: ebuild.sh, line 1546: Called dyn_compile ebuild.sh, line 937: Called src_compile ebuild.sh, line 1255: Called gnome2_src_compile gnome2.eclass, line 64: Called die !!! compile failure !!! If you need support, post the topmost build error, and the call stack if relevant.