/usr/lib/gcc/i686-pc-linux-gnu/3.4.6/../../../../i686-pc-linux-gnu/bin/ld: warning: libssl.so.0.9.7, needed by /usr/lib/libcurl.so, may conflict with libssl.so.0.9.8 /usr/lib/gcc/i686-pc-linux-gnu/3.4.6/../../../../i686-pc-linux-gnu/bin/ld: warning: libcrypto.so.0.9.7, needed by /usr/lib/libcurl.so, may conflict with libcrypto.so.0.9.8 /usr/local/lib/libedje.so: undefined reference to `evas_object_gradient_color_stop_add' /usr/local/lib/libedje.so: undefined reference to `evas_object_gradient_alpha_stop_add' /usr/local/lib/libedje.so: undefined reference to `evas_object_gradient_fill_angle_set' /usr/local/lib/libedje.so: undefined reference to `evas_object_gradient_fill_spread_set' /usr/local/lib/libedje.so: undefined reference to `evas_object_gradient_clear' collect2: ld returned 1 exit status make[2]: *** [esmart_test] Error 1 make[2]: Leaving directory `/home/sam412/e17/libs/esmart/src/bin' make[1]: *** [install-recursive] Error 1 make[1]: Leaving directory `/home/sam412/e17/libs/esmart/src' make: *** [install-recursive] Error 1 Error running 'make install'. See above error messages.