PASS: t-import wrong result data at data[0] align=0 src "0" src=0x0 order=1 size=1 endian=1 nail=0 want count 0 got count 0 want got /bin/sh: line 4: 32045 Aborted ${dir}$tst FAIL: t-export PASS: t-pprime_p ================================== 1 of 56 tests failed Please report to gmp-bugs@swox.com ================================== make[4]: *** [check-TESTS] Error 1 make[4]: Leaving directory `/var/tmp/portage/gmp-4.2.1/work/gmp-4.2.1/tests/mpz' make[3]: *** [check-am] Error 2 make[3]: Leaving directory `/var/tmp/portage/gmp-4.2.1/work/gmp-4.2.1/tests/mpz' make[2]: *** [check-recursive] Error 1 make[2]: Leaving directory `/var/tmp/portage/gmp-4.2.1/work/gmp-4.2.1/tests' make[1]: *** [check-recursive] Error 1 make[1]: Leaving directory `/var/tmp/portage/gmp-4.2.1/work/gmp-4.2.1' make: *** [check] Error 2 !!! ERROR: dev-libs/gmp-4.2.1 failed. Call stack: ebuild.sh, line 1546: Called dyn_test ebuild.sh, line 986: Called src_test ebuild.sh, line 616: Called die !!! Make check failed. See above for details. !!! If you need support, post the topmost build error, and the call stack if relevant.