make[1]: Entering directory `/usr/src/redhat/BUILD/asterisk/stdtime' gcc -O2 -g -pipe -m32 -march=i686 -mtune=pentium4 -c -o localtime.o localtime.c localtime.c:29:27: asterisk/lock.h: No such file or directory localtime.c:30:32: asterisk/localtime.h: No such file or directory localtime.c:191: warning: parameter names (without types) in function declaration localtime.c:191: warning: data definition has no type or storage class localtime.c:192: warning: parameter names (without types) in function declaration localtime.c:192: warning: data definition has no type or storage class localtime.c:193: warning: parameter names (without types) in function declaration localtime.c:193: warning: data definition has no type or storage class localtime.c:194: warning: parameter names (without types) in function declaration localtime.c:194: warning: data definition has no type or storage class localtime.c: In function `ast_tzsetwall': localtime.c:890: error: `tzsetwall_mutex' undeclared (first use in this function) localtime.c:890: error: (Each undeclared identifier is reported only once localtime.c:890: error: for each function it appears in.) localtime.c: In function `ast_tzset': localtime.c:960: error: `tzset_mutex' undeclared (first use in this function) localtime.c: In function `ast_localtime': localtime.c:1050: error: `lcl_mutex' undeclared (first use in this function) localtime.c: In function `gmtsub': localtime.c:1072: error: `gmt_mutex' undeclared (first use in this function) localtime.c: In function `ast_mktime': localtime.c:1490: error: `lcl_mutex' undeclared (first use in this function) make[1]: *** [localtime.o] Error 1 make[1]: Leaving directory `/usr/src/redhat/BUILD/asterisk/stdtime' make: *** [stdtime/libtime.a] Error 2 error: Bad exit status from /var/tmp/rpm-tmp.93914 (%install)