collect2: ld returned 1 exit status make[4]: *** [gtk-demo] Error 1 make[4]: Leaving directory `/home/allan/gtk+-2.4.9/demos/gtk-demo' make[3]: *** [install] Error 2 make[3]: Leaving directory `/home/allan/gtk+-2.4.9/demos/gtk-demo' make[2]: *** [install-recursive] Error 1 make[2]: Leaving directory `/home/allan/gtk+-2.4.9/demos' make[1]: *** [install] Error 2 make[1]: Leaving directory `/home/allan/gtk+-2.4.9/demos' make: *** [install-recursive] Error 1