../../../../openocd-master/src/jtag/drivers/usbprog.c: In function 'usbprog_state_move': ../../../../openocd-master/src/jtag/drivers/usbprog.c:217:13: error: variable 'tms' set but not used [-Werror=unused-but-set-variable] cc1: all warnings being treated as errors make[6]: *** [usbprog.lo] Error 1 make[6]: *** Waiting for unfinished jobs.... mv -f .deps/presto.Tpo .deps/presto.Plo mv -f .deps/ft2232.Tpo .deps/ft2232.Plo make[6]: Leaving directory `/home/gerald/Desktop/Downloads/esden-summon-arm-toolchain-9b7cedd/build/src/jtag/drivers' make[5]: *** [all-recursive] Error 1 make[5]: Leaving directory `/home/gerald/Desktop/Downloads/esden-summon-arm-toolchain-9b7cedd/build/src/jtag' make[4]: *** [all] Error 2 make[4]: Leaving directory `/home/gerald/Desktop/Downloads/esden-summon-arm-toolchain-9b7cedd/build/src/jtag' make[3]: *** [all-recursive] Error 1 make[3]: Leaving directory `/home/gerald/Desktop/Downloads/esden-summon-arm-toolchain-9b7cedd/build/src' make[2]: *** [all] Error 2 make[2]: Leaving directory `/home/gerald/Desktop/Downloads/esden-summon-arm-toolchain-9b7cedd/build/src' make[1]: *** [all-recursive] Error 1 make[1]: Leaving directory `/home/gerald/Desktop/Downloads/esden-summon-arm-toolchain-9b7cedd/build' make: *** [all] Error 2