[ 91%] Building CXX object nsplugins/viewer/CMakeFiles/nspluginviewer.dir/nspluginviewer_final_cpp.o In file included from /tmp/kdebase-4.6.3/build/nsplugins/viewer/nspluginviewer_final_cpp.cpp:2:0: /tmp/kdebase-4.6.3/nsplugins/viewer/nsplugin.cpp:1701:2: warning: #warning added a const_cast [-Wcpp] In file included from /tmp/kdebase-4.6.3/build/nsplugins/viewer/nspluginviewer_final_cpp.cpp:2:0: /tmp/kdebase-4.6.3/nsplugins/viewer/nsplugin.cpp: In function 'NPError g_NPN_GetValue(NPP, NPNVariable, void*)': /tmp/kdebase-4.6.3/nsplugins/viewer/nsplugin.cpp:220:7: warning: case value '13' not in enumerated type 'NPNVariable' [-Wswi In file included from /tmp/kdebase-4.6.3/build/nsplugins/viewer/nspluginviewer_final_cpp.cpp:6:0: /tmp/kdebase-4.6.3/nsplugins/viewer/pluginhost_xembed.cpp: In member function 'virtual void PluginHostXEmbed::setupWindow(in /tmp/kdebase-4.6.3/nsplugins/viewer/pluginhost_xembed.cpp:43:39: warning: cast to pointer from integer of different size [-W /tmp/kdebase-4.6.3/nsplugins/viewer/pluginhost_xembed.cpp: In member function 'virtual void PluginHostXEmbed::resizePlugin(i /tmp/kdebase-4.6.3/nsplugins/viewer/pluginhost_xembed.cpp:51:43: warning: cast to pointer from integer of different size [-W In file included from /tmp/kdebase-4.6.3/nsplugins/viewer/scripting.cpp:30:0, from /tmp/kdebase-4.6.3/build/nsplugins/viewer/nspluginviewer_final_cpp.cpp:9: /tmp/kdebase-4.6.3/nsplugins/viewer/scripting.h: At global scope: /tmp/kdebase-4.6.3/nsplugins/viewer/scripting.h:33:7: error: redefinition of 'class kdeNsPluginViewer::ScriptExportEngine' /tmp/kdebase-4.6.3/nsplugins/viewer/scripting.h:33:7: error: previous definition of 'class kdeNsPluginViewer::ScriptExportEn make[2]: *** [nsplugins/viewer/CMakeFiles/nspluginviewer.dir/nspluginviewer_final_cpp.o] Error 1 make[1]: *** [nsplugins/viewer/CMakeFiles/nspluginviewer.dir/all] Error 2 make: *** [all] Error 2