..\..\src\cryptovpn\viewlog.cpp: In member function 'bool ViewLog::load(const QString&)': ..\..\src\cryptovpn\viewlog.cpp:123: error: expected ')' before ';' token mingw32-make[2]: Leaving directory `C:/Projects/vpngui2/in-disguise-build-desktop/cryptovpn' mingw32-make[1]: Leaving directory `C:/Projects/vpngui2/in-disguise-build-desktop/cryptovpn' mingw32-make: Leaving directory `C:/Projects/vpngui2/in-disguise-build-desktop' mingw32-make[2]: *** [obj/viewlog.o] Error 1 mingw32-make[1]: *** [release] Error 2 mingw32-make: *** [sub-cryptovpn-in-disguise-pro-make_default] Error 2 The process "C:/Qt/2010.05/mingw/bin/mingw32-make.exe" exited with code %2. Error while building project in-disguise (target: Desktop) When executing build step 'Make'