patch -p0 < patch.txt patching file modules/core/module.inc Hunk #1 FAILED at 34. 1 out of 1 hunk FAILED -- saving rejects to file modules/core/module.inc.rej patching file modules/core/classes/ConvertDatabaseToUtf8Task.class patching file modules/core/CoreModuleExtras.inc Hunk #1 succeeded at 107 with fuzz 2 (offset 42 lines). Hunk #2 FAILED at 1782. Hunk #3 FAILED at 2083. Hunk #4 FAILED at 2352. Hunk #5 FAILED at 2795. patch unexpectedly ends in middle of line Hunk #6 succeeded at 2843 with fuzz 2 (offset 53 lines). 4 out of 6 hunks FAILED -- saving rejects to file modules/core/CoreModuleExtras.inc.rej [root@216-55-156-36 gallery]# patch -p0 < patch.txt patching file modules/core/module.inc Hunk #1 FAILED at 34. 1 out of 1 hunk FAILED -- saving rejects to file modules/core/module.inc.rej patching file modules/core/classes/ConvertDatabaseToUtf8Task.class patching file modules/core/CoreModuleExtras.inc Hunk #1 succeeded at 107 with fuzz 2 (offset 42 lines). Hunk #2 FAILED at 1782. Hunk #3 FAILED at 2083. Hunk #4 FAILED at 2352. Hunk #5 FAILED at 2795. patch unexpectedly ends in middle of line Hunk #6 succeeded at 2843 with fuzz 2 (offset 53 lines). 4 out of 6 hunks FAILED -- saving rejects to file modules/core/CoreModuleExtras.inc.rej