/home/gl_wowserver/TrinityCore/src/server/game/Spells/SpellEffects.cpp: In member function âvoid Spell::EffectTriggerSpell(SpellEffIndex)â: /home/gl_wowserver/TrinityCore/src/server/game/Spells/SpellEffects.cpp:1677: error: âclass Unitâ has no member named âGetPetâ /home/gl_wowserver/TrinityCore/src/server/game/Spells/SpellEffects.cpp:1686: error: âtargetâ was not declared in this scope /home/gl_wowserver/TrinityCore/src/server/game/Spells/SpellEffects.cpp:1686: error: âGetOwnerâ was not declared in this scope /home/gl_wowserver/TrinityCore/src/server/game/Spells/SpellEffects.cpp:1688: error: return-statement with a value, in function returning 'void' /home/gl_wowserver/TrinityCore/src/server/game/Spells/SpellEffects.cpp:1690: error: âbasepoints0â was not declared in this scope /home/gl_wowserver/TrinityCore/src/server/game/Spells/SpellEffects.cpp:1697: error: expected `}' before âelseâ /home/gl_wowserver/TrinityCore/src/server/game/Spells/SpellEffects.cpp:1697: error: expected `}' before âelseâ /home/gl_wowserver/TrinityCore/src/server/game/Spells/SpellEffects.cpp:1697: error: âGetEntryâ was not declared in this scope /home/gl_wowserver/TrinityCore/src/server/game/Spells/SpellEffects.cpp:1699: error: âGetOwnerâ was not declared in this scope /home/gl_wowserver/TrinityCore/src/server/game/Spells/SpellEffects.cpp:1703: error: âbonusDamageâ was not declared in this scope /home/gl_wowserver/TrinityCore/src/server/game/Spells/SpellEffects.cpp: At global scope: /home/gl_wowserver/TrinityCore/src/server/game/Spells/SpellEffects.cpp:1707: error: expected declaration before â}â token make[2]: *** [src/server/game/CMakeFiles/game.dir/Spells/SpellEffects.cpp.o] Error 1 make[1]: *** [src/server/game/CMakeFiles/game.dir/all] Error 2 make: *** [all] Error 2