/home/gl_wowserver/TrinityCore/src/server/game/Spells/SpellEffects.cpp: In member function âvoid Spell::EffectTriggerSpell(SpellEffIndex)â: /home/gl_wowserver/TrinityCore/src/server/game/Spells/SpellEffects.cpp:1677: error: âtargetâ was not declared in this scope /home/gl_wowserver/TrinityCore/src/server/game/Spells/SpellEffects.cpp:1677: error: âGetOwnerâ was not declared in this scope /home/gl_wowserver/TrinityCore/src/server/game/Spells/SpellEffects.cpp:1679: error: return-statement with a value, in function returning 'void' /home/gl_wowserver/TrinityCore/src/server/game/Spells/SpellEffects.cpp:1681: error: âbasepoints0â was not declared in this scope make[2]: *** [src/server/game/CMakeFiles/game.dir/Spells/SpellEffects.cpp.o] Error 1 make[1]: *** [src/server/game/CMakeFiles/game.dir/all] Error 2 make: *** [all] Error 2