*** Building rarian *** [7/7] make V=1 -j 4 make all-recursive make[1]: Entering directory `/home/jim/checkout/gnome/rarian-0.8.1' Making all in librarian make[2]: Entering directory `/home/jim/checkout/gnome/rarian-0.8.1/librarian' make[2]: Nothing to be done for `all'. make[2]: Leaving directory `/home/jim/checkout/gnome/rarian-0.8.1/librarian' Making all in util make[2]: Entering directory `/home/jim/checkout/gnome/rarian-0.8.1/util' /bin/bash ../libtool --tag=CC --mode=link gcc -g -O2 -L/opt/gnome/lib64 -o rarian-example rarian-example.o ../librarian/librarian.la gcc -g -O2 -o .libs/rarian-example rarian-example.o -L/opt/gnome/lib64 ../librarian/.libs/librarian.so -Wl,--rpath -Wl,/opt/gnome/lib64 ../librarian/.libs/librarian.so: undefined reference to `operator delete(void*)' ../librarian/.libs/librarian.so: undefined reference to `operator new[](unsigned long)' ../librarian/.libs/librarian.so: undefined reference to `__cxa_pure_virtual' ../librarian/.libs/librarian.so: undefined reference to `operator delete[](void*)' ../librarian/.libs/librarian.so: undefined reference to `__gxx_personality_v0' ../librarian/.libs/librarian.so: undefined reference to `vtable for __cxxabiv1::__si_class_type_info' ../librarian/.libs/librarian.so: undefined reference to `operator new(unsigned long)' ../librarian/.libs/librarian.so: undefined reference to `vtable for __cxxabiv1::__class_type_info' collect2: ld returned 1 exit status make[2]: *** [rarian-example] Error 1 make[2]: Leaving directory `/home/jim/checkout/gnome/rarian-0.8.1/util' make[1]: *** [all-recursive] Error 1 make[1]: Leaving directory `/home/jim/checkout/gnome/rarian-0.8.1' make: *** [all] Error 2 *** Error during phase build of rarian: ########## Error running make V=1 -j 4 *** [7/7] [1] Rerun phase build