# scripts/bootstrap.sh ... Making all in util make[2]: Entering directory `/tmp/portage/portage/texinfo-4.7-r1/work/texinfo-4.7/util' if gcc -DHAVE_CONFIG_H -I. -I. -I.. -I../lib -I../intl -DLOCALEDIR=\"/usr/share/locale\" -march=pentium3 -O3 -pipe -fomit-frame-pointer -fforce-addr -MT install-info.o -MD -MP -MF ".deps/install-info.Tpo" -c -o install-info.o install-info.c; \ then mv -f ".deps/install-info.Tpo" ".deps/install-info.Po"; else rm -f ".deps/install-info.Tpo"; exit 1; fi if gcc -DHAVE_CONFIG_H -I. -I. -I.. -I../lib -I../intl -DLOCALEDIR=\"/usr/share/locale\" -march=pentium3 -O3 -pipe -fomit-frame-pointer -fforce-addr -MT texindex.o -MD -MP -MF ".deps/texindex.Tpo" -c -o texindex.o texindex.c; \ then mv -f ".deps/texindex.Tpo" ".deps/texindex.Po"; else rm -f ".deps/texindex.Tpo"; exit 1; fi sed 's/__VERSION__/4.7/g' texinfo-cat.in >texinfo.cat gcc -march=pentium3 -O3 -pipe -fomit-frame-pointer -fforce-addr -o texindex texindex.o ../lib/libtxi.a gcc -march=pentium3 -O3 -pipe -fomit-frame-pointer -fforce-addr -o ginstall-info install-info.o ../lib/libtxi.a collect2: ld terminated with signal 11 [Segmentation fault] make[2]: *** [texindex] Error 1 make[2]: Leaving directory `/tmp/portage/portage/texinfo-4.7-r1/work/texinfo-4.7/util' make[1]: *** [all-recursive] Error 1 make[1]: Leaving directory `/tmp/portage/portage/texinfo-4.7-r1/work/texinfo-4.7' make: *** [all] Error 2 !!! ERROR: sys-apps/texinfo-4.7-r1 failed. !!! Function src_compile, Line 54, Exitcode 2 !!! (no error message) !!! If you need support, post the topmost build error, NOT this status message.