making in lang/cmu_us_kal16 ... virtual memory exhausted: Cannot allocate memory make[8]: *** [../../build/i386-linux-gnu/obj/lang/cmu_us_kal16/cmu_us_kal16_res.o] Error 1 make[7]: *** [../build/i386-linux-gnu/obj/lang/.make_build_dirs] Error 2 make[6]: *** [build/i386-linux-gnu/obj//.make_build_dirs] Error 2 make[5]: *** [/usr/src/freeswitch/libs/flite-1.5.4-current/build/libs/libflite_cmu_us_awb.a] Error 2 make[4]: *** [all] Error 1 make[3]: *** [mod_flite-all] Error 1 make[2]: *** [all-recursive] Error 1 make[1]: *** [all-recursive] Error 1 make: *** [all] Error 2 Command exited with non-zero status 2 2.46user 1.79system 0:10.69elapsed 39%CPU (0avgtext+0avgdata 135376maxresident)k 0inputs+0outputs (6major+657345minor)pagefaults 0swaps ERROR: FreeSWITCH Build Failure. root@286320:~#