In file included from cabac.c:32: cabac.h: In function 'decode_significance_x86': cabac.h:686: error: expected ':' or ')' before 'BRANCHLESS_GET_CABAC' cabac.h:678: warning: unused variable 'minusindex' cabac.h:677: warning: unused variable 'minusstart' cabac.h:676: warning: unused variable 'end' cabac.h: In function 'decode_significance_8x8_x86': cabac.h:740: error: expected ':' or ')' before 'BRANCHLESS_GET_CABAC' cabac.h:728: warning: unused variable 'last' cabac.h:726: warning: unused variable 'minusindex' make[1]: *** [cabac.o] Error 1