/home/esel/amulelibs/wxgtkcvs//lib/libwx_gtk2u_core-2.6.so: undefined reference to `std::basic_streambuf >::uflow()' collect2: ld returned 1 exit status make[6]: *** [wxcas] Fehler 1 make[6]: Verlasse Verzeichnis »/home/esel/amule-cvs/src/utils/wxCas/src« make[5]: *** [all-recursive] Fehler 1 make[5]: Verlasse Verzeichnis »/home/esel/amule-cvs/src/utils/wxCas« make[4]: *** [all-recursive] Fehler 1 make[4]: Verlasse Verzeichnis »/home/esel/amule-cvs/src/utils« make[3]: *** [all-recursive] Fehler 1 make[3]: Verlasse Verzeichnis »/home/esel/amule-cvs/src« make[2]: *** [all] Fehler 2 make[2]: Verlasse Verzeichnis »/home/esel/amule-cvs/src« make[1]: *** [all-recursive] Fehler 1 make[1]: Verlasse Verzeichnis »/home/esel/amule-cvs« make: *** [all] Fehler 2