tns.c: In function `tns_decode_frame': tns.c:130: error: insn does not satisfy its constraints: (insn 751 445 446 25 (set (reg:QI 8 %a0) (mem:QI (plus:SI (reg/f:SI 14 %a6) (const_int -255 [0xffffff01])) [44 tns_order+0 S1 A8])) 33 {*m68k.md:826} (nil) (nil)) tns.c:130: internal compiler error: in reload_cse_simplify_operands, at postreload.c:391 Please submit a full bug report, with preprocessed source if appropriate. See for instructions. make[3]: *** [/home/martin/src/dev/rockbox-devel/build-h120/apps/codecs/libfaad/tns.o] Error 1 make[2]: *** [libfaad] Error 2 make[1]: *** [build-codecs] Error 2 make: *** [all] Error 2