CC [M] /home/juuva/cluster/drbd-8.0pre5/drbd/drbd_nl.o In file included from /home/juuva/cluster/drbd-8.0pre5/drbd/drbd_nl.c:34: /home/juuva/cluster/drbd-8.0pre5/drbd/linux/connector.h:170: error: syntax error before "gfp_t" /home/juuva/cluster/drbd-8.0pre5/drbd/linux/connector.h:170: warning: function declaration isn't a prototype make[3]: *** [/home/juuva/cluster/drbd-8.0pre5/drbd/drbd_nl.o] Error 1 make[2]: *** [_module_/home/juuva/cluster/drbd-8.0pre5/drbd] Error 2 make[2]: Leaving directory `/lib/modules/2.6.12-1.1381_FC3/build' make[1]: *** [kbuild] Error 2 make[1]: Leaving directory `/home/juuva/cluster/drbd-8.0pre5/drbd' make: *** [all] Error 2