i686-pc-linux-gnu-gcc -DHAVE_CONFIG_H -I. -I. -I.. -I. -I.. -I../lib -DIN_CRACKLIB -DDEFA ULT_CRACKLIB_DICT=\"/usr/lib/cracklib_dict\" -O2 -march=pentium4 -fomit-frame-pointer -c f ascist.c -o fascist.o >/dev/null 2>&1 /bin/sh ../libtool --mode=compile i686-pc-linux-gnu-gcc -DHAVE_CONFIG_H -I. -I. -I.. -I. -I.. -I../lib -DIN_CRACKLIB '-DDEFAULT_CRACKLIB_DICT="/usr/lib/cracklib_dict"' -O2 -marc h=pentium4 -fomit-frame-pointer -c -o packlib.lo `test -f 'packlib.c' || echo './'`packlib .c Inconsistency detected by ld.so: rtld.c: 1075: dl_main: Assertion `_rtld_local._dl_rtld_ma p.l_libname' failed! make[2]: *** [packlib.lo] Error 127 make[2]: Leaving directory `/var/tmp/portage/cracklib-2.8.3-r1/work/cracklib-2.8.3/lib' make[1]: *** [all-recursive] Error 1 make[1]: Leaving directory `/var/tmp/portage/cracklib-2.8.3-r1/work/cracklib-2.8.3' make: *** [all] Error 2 !!! ERROR: sys-libs/cracklib-2.8.3-r1 failed. !!! Function src_compile, Line 31, Exitcode 2 !!! (no error message) !!! If you need support, post the topmost build error, NOT this status message.