make all make -C src all make[1]: Entering directory `/home/ruskie/current/cLinux/cinit/src' ../tmpbin/cc -c -o core/build_argv.o core/build_argv.c In file included from headers/cinit.h:10, from core/build_argv.c:29: headers/config.h:2:9: error: macro names must be identifiers core/build_argv.c: In function ‘cinit_build_argv’: core/build_argv.c:89: error: ‘C_PARAMS’ undeclared (first use in this function) core/build_argv.c:89: error: (Each undeclared identifier is reported only once core/build_argv.c:89: error: for each function it appears in.) core/build_argv.c:159: error: ‘C_ENV’ undeclared (first use in this function) make[1]: *** [core/build_argv.o] Error 1 make[1]: Leaving directory `/home/ruskie/current/cLinux/cinit/src' make: *** [sources] Error 2