ldt_keeper.c: In function `Setup_LDT_Keeper': ldt_keeper.c:190: error: storage size of `array' isn't known ldt_keeper.c:224: error: invalid application of `sizeof' to an incomplete type make[1]: *** [ldt_keeper.o] Error 1