Building modules, stage 2. make[6]: scripts/mod/modpost: Command not found make[6]: *** [__modpost] Error 127 make[5]: *** [modules] Error 2 nm: '../../../obj-ppc/build/src/kmod/Linux/..//mol.ko': No such file nm: '../../../obj-ppc/build/src/kmod/Linux/..//mol.ko': No such file checker.pl failed rm: cannot remove `../../../obj-ppc/build/src/kmod/Linux/..//mol.ko': No such file or directory make[4]: *** [all-local] Error 1