/usr/local/bin/g++43 -c -pipe -O2 -fPIC -Wall -W -pthread -D_THREAD_SAFE -DQCA_ STATIC -DBOTAN_TYPES_QT -DBOTAN_NO_INIT_H -DBOTAN_NO_CONF_H -DBOTAN_TOOLS_ONLY - DBOTAN_MINIMAL_BIGINT -DBOTAN_MP_WORD_BITS=32 -DBOTAN_VECTOR_OVER_ALLOCATE=4 -DO SSL_097 -DHAVE_OPENSSL -DHAVE_CYRUSSASL -DQCA_SYSTEMSTORE_PATH=\"/home/creep/sha re/psi/certs/rootcerts.pem\" -DHAVE_XSS -DHAVE_ASPELL -DHAVE_CONFIG -DQT_NO_DEBU G -DQT_CORE_LIB -DQT_SHARED -I../../../../qt4/mkspecs/freebsd-g++ -I. -I../../.. /../qt4/include/QtCore -I../../../../qt4/include/QtCore -I../../../../qt4/includ e -Iinclude/QtCrypto -I. -Ibotantools/botan -I/usr/local/include -I/usr/local/in clude -I.moc -I. -I/usr/local/include -o .obj/mlock.o botantools/botan/ml_unix/m lock.cpp In file included from /usr/local/lib/gcc-4.3.0/include/c++/bits/postypes.h:46, from /usr/local/lib/gcc-4.3.0/include/c++/iosfwd:49, from /usr/local/lib/gcc-4.3.0/include/c++/bits/stl_algobase.h:7 0, from /usr/local/lib/gcc-4.3.0/include/c++/bits/char_traits.h:46 , from /usr/local/lib/gcc-4.3.0/include/c++/string:46, from botantools/botan/botan/util.h:39, from botantools/botan/ml_unix/mlock.cpp:34: /usr/local/lib/gcc-4.3.0/include/c++/cwchar:169: error: '::vfwscanf' has not bee n declared /usr/local/lib/gcc-4.3.0/include/c++/cwchar:173: error: '::vswscanf' has not bee n declared /usr/local/lib/gcc-4.3.0/include/c++/cwchar:177: error: '::vwscanf' has not been declared /usr/local/lib/gcc-4.3.0/include/c++/cwchar:194: error: '::wcstof' has not been declared gmake[1]: *** [.obj/mlock.o] Błąd 1 gmake[1]: Opuszczenie katalogu `/home/creep/project/psi-dev-snapshot-2006-11-07/ third-party/qca' gmake: *** [sub-third-party_qca-make_default] Błąd 2