RPATH: lib/scribus/plugins/;/usr/local/lib/lib -- Configuring done -- Generating done -- Build files have been written to: /home/mrdocs/cvs/cmakescribus CMakeFiles/Makefile2:1700: warning: overriding commands for target `scribus/styles/CMakeFiles/scribus_styles_lib.dir/all' CMakeFiles/Makefile2:1594: warning: ignoring old commands for target `scribus/styles/CMakeFiles/scribus_styles_lib.dir/all' CMakeFiles/Makefile2:1710: warning: overriding commands for target `scribus/styles/CMakeFiles/scribus_styles_lib.dir/rule' CMakeFiles/Makefile2:1604: warning: ignoring old commands for target `scribus/styles/CMakeFiles/scribus_styles_lib.dir/rule' CMakeFiles/Makefile2:1719: warning: overriding commands for target `scribus/styles/CMakeFiles/scribus_styles_lib.dir/clean' CMakeFiles/Makefile2:1613: warning: ignoring old commands for target `scribus/styles/CMakeFiles/scribus_styles_lib.dir/clean' Built target scribus_pixbuf_lib Built target scribus_desaxe_lib Built target scribus_text_lib Built target scribus_styles_lib Built target scribus_fonts_lib Building CXX object scribus/CMakeFiles/scribus.dir/stylemanager.o /home/mrdocs/cvs/13/Scribus/scribus/stylemanager.cpp: In constructor ‘StyleManager::StyleManager(QWidget*, const char*)’: /home/mrdocs/cvs/13/Scribus/scribus/stylemanager.cpp:44: error: ‘styleViewFrame’ was not declared in this scope make[2]: *** [scribus/CMakeFiles/scribus.dir/stylemanager.o] Error 1 make[1]: *** [scribus/CMakeFiles/scribus.dir/all] Error 2 make: *** [all] Error 2